Make Error for bin/SARndbox

Home Forums AR Sandbox Forum Make Error for bin/SARndbox

Viewing 2 posts - 1 through 2 (of 2 total)
  • Author
  • #2393

    Hi, I’ve managed to get through all the other steps and went to run the Sandbox before discovering I was likely missing a file. I went to reinstall the software and this is the error I’ve come across.

    Compiling Sandbox.cpp…
    Linking bin/SARndbox…
    /usr/bin/ld: _ZN18GLARBShaderObjects7currentE: TLS reference in o/g++-3.g0.O3/ShaderHelper.o mismatches non-TLS reference in o/g++-3.g0.O3/DepthImageRenderer.o
    o/g++-3.g0.O3/DepthImageRenderer.o: error adding symbols: Bad value
    collect2: error: ld returned 1 exit status
    /usr/local/share/Vrui-8.0/make/BasicMakefile:320: recipe for target ‘bin/SARndbox’ failed
    make: *** [bin/SARndbox] Error 1
    em1@em1-TMP645-M:~/src/SARndbox-2.8$ ls ./bin
    CalibrateProjector SARndboxClient

    Sean Robinson

    The error you shared looks like a system library has changed between building Vrui and this latest build of SARndbox.

    I think you will need to rebuild Vrui, Kinect, and SARndbox, Remove the “src” directory and start from Step 3.

    If that does not fix the error, please post a full transcript of a failed SARndbox build attempt.

Viewing 2 posts - 1 through 2 (of 2 total)
  • You must be logged in to reply to this topic.